Reaction Details
TargetPlatelet-derived growth factor receptor beta
LigandBDBM50181317
Substrate/Competitorn/a
Meas. Tech.ChEMBL_559890 (CHEMBL1011001)
IC50 20±n/a nM
Citation Renhowe, PAPecchi, SShafer, CMMachajewski, TDJazan, EMTaylor, CAntonios-McCrea, WMcBride, CMFrazier, KWiesmann, MLapointe, GRFeucht, PHWarne, RLHeise, CCMenezes, DAardalen, KYe, HHe, MLe, VVora, JJansen, JMWernette-Hammond, MEHarris, AL Design, structure-activity relationships and in vivo characterization of 4-amino-3-benzimidazol-2-ylhydroquinolin-2-ones: a novel class of receptor tyrosine kinase inhibitors. J Med Chem52:278-92 (2009) 
 
Platelet-derived growth factor receptor beta
Name:Platelet-derived growth factor receptor beta
Type:Enzyme
Mol. Mass.:123922.25
Organism:Homo sapiens (Human)
Description:P09619
Residue:1106
BDBM50181317
NameBDBM50181317
Synonyms:3-(1H-benzo[d]imidazol-2-yl)-4-hydroxyquinolin-2(1H)-one | CHEMBL377345
TypeSmall organic molecule
Emp. Form.C16H11N3O2
Mol. Mass.277.2774
SMILESOc1c(-c2nc3ccccc3[nH]2)c(=O)[nH]c2ccccc12