Reaction Details
TargetCoagulation factor VII
LigandBDBM35743
Substrate/Competitorn/a
Meas. Tech.ChEMBL_516026 (CHEMBL981515)
Ki>100000±n/a nM
Citation Nagata, TYoshino, THaginoya, NYoshikawa, KNagamochi, MKobayashi, SKomoriya, SYokomizo, AMuto, RYamaguchi, MOsanai, KSuzuki, MKanno, H Discovery of N-[(1R,2S,5S)-2-{[(5-chloroindol-2-yl)carbonyl]amino}-5-(dimethylcarbamoyl)cyclohexyl]-5-methyl-4,5,6,7-tetrahydrothiazolo[5,4-c]pyridine-2-carboxamide hydrochloride: a novel, potent and orally active direct inhibitor of factor Xa. Bioorg Med Chem17:1193-206 (2009) 
 
Coagulation factor VII
Name:Coagulation factor VII
Type:Enzyme
Mol. Mass.:51599.89
Organism:Homo sapiens (Human)
Description:n/a
Residue:466
BDBM35743
NameBDBM35743
Synonyms:CHEMBL479863 | cis-1,2-diaminocyclohexane derivative, A
TypeSmall organic molecule
Emp. Form.C26H31ClN6O3S
Mol. Mass.543.081
SMILESCN(C)C(=O)[C@H]1CC[C@H](NC(=O)c2cc3cc(Cl)ccc3[nH]2)[C@@H](C1)NC(=O)c1nc2CCN(C)Cc2s1