Reaction Details
TargetHistone deacetylase 1
LigandBDBM50248375
Substrate/Competitorn/a
Meas. Tech.ChEMBL_543051 (CHEMBL1021292)
IC50 47±n/a nM
Citation Wang, HYu, NSong, HChen, DZou, YDeng, WLye, PLChang, JNg, MSun, ETSangthongpitag, KWang, XWu, XKhng, HHFang, LGoh, SKOng, WCBonday, ZStünkel, WPoulsen, AEntzeroth, M N-Hydroxy-1,2-disubstituted-1H-benzimidazol-5-yl acrylamides as novel histone deacetylase inhibitors: design, synthesis, SAR studies, and in vivo antitumor activity. Bioorg Med Chem Lett19:1403-8 (2009) 
 
Histone deacetylase 1
Name:Histone deacetylase 1
Type:Enzyme
Mol. Mass.:55090.27
Organism:Homo sapiens (Human)
Description:Q13547
Residue:482
BDBM50248375
NameBDBM50248375
Synonyms:CHEMBL491688 US10201527, Compound 2 US8551988, 2
TypeSmall organic molecule
Emp. Form.C28H29N3O5
Mol. Mass.487.547
SMILESCOc1cc(Cn2c(CCc3ccccc3)nc3cc(\C=C\C(=O)NO)ccc23)cc(OC)c1OC