Reaction Details
TargetHistone deacetylase 1
LigandBDBM50248571
Substrate/Competitorn/a
Meas. Tech.ChEMBL_543051 (CHEMBL1021292)
IC50>10000±n/a nM
Citation Wang, HYu, NSong, HChen, DZou, YDeng, WLye, PLChang, JNg, MSun, ETSangthongpitag, KWang, XWu, XKhng, HHFang, LGoh, SKOng, WCBonday, ZStünkel, WPoulsen, AEntzeroth, M N-Hydroxy-1,2-disubstituted-1H-benzimidazol-5-yl acrylamides as novel histone deacetylase inhibitors: design, synthesis, SAR studies, and in vivo antitumor activity. Bioorg Med Chem Lett19:1403-8 (2009) 
 
Histone deacetylase 1
Name:Histone deacetylase 1
Type:Enzyme
Mol. Mass.:55090.27
Organism:Homo sapiens (Human)
Description:Q13547
Residue:482
BDBM50248571
NameBDBM50248571
Synonyms:CHEMBL461173 US10201527, Compound 29 US8551988, 29
TypeSmall organic molecule
Emp. Form.C17H25N3O3
Mol. Mass.319.3987
SMILESCC(C)Cc1nc2cc(CCC(=O)NO)ccc2n1CCCO