Reaction Details
TargetSodium- and chloride-dependent glycine transporter 1
LigandBDBM50248099
Substrate/Competitorn/a
Meas. Tech.ChEMBL_543461 (CHEMBL1016009)
IC50 30±n/a nM
Citation Wolkenberg, SEZhao, ZWisnoski, DDLeister, WHO'Brien, JLemaire, WWilliams, DLJacobson, MASur, CKinney, GGPettibone, DJTiller, PRSmith, SGibson, CMa, BKPolsky-Fisher, SLLindsley, CWHartman, GD Discovery of GlyT1 inhibitors with improved pharmacokinetic properties. Bioorg Med Chem Lett19:1492-5 (2009) 
 
Sodium- and chloride-dependent glycine transporter 1
Name:Sodium- and chloride-dependent glycine transporter 1
Type:Enzyme
Mol. Mass.:78270.54
Organism:Homo sapiens (Human)
Description:P48067
Residue:706
BDBM50248099
NameBDBM50248099
Synonyms:2,4-dichloro-N-((4-(cyclopropylmethyl)-1-(propylsulfonyl)piperidin-4-yl)methyl)benzamide | CHEMBL462149
TypeSmall organic molecule
Emp. Form.C20H28Cl2N2O3S
Mol. Mass.447.419
SMILESCCCS(=O)(=O)N1CCC(CNC(=O)c2ccc(Cl)cc2Cl)(CC2CC2)CC1