Reaction Details
TargetHexokinase-4
LigandBDBM50248270
Substrate/Competitorn/a
Meas. Tech.ChEMBL_565879 (CHEMBL959302)
EC50 2600±n/a nM
Citation Nishimura, TIino, TMitsuya, MBamba, MWatanabe, HTsukahara, DKamata, KSasaki, KOhyama, SHosaka, HFutamura, MNagata, YEiki, J Identification of novel and potent 2-amino benzamide derivatives as allosteric glucokinase activators. Bioorg Med Chem Lett19:1357-60 (2009) 
 
Hexokinase-4
Name:Hexokinase-4
Type:Enzyme
Mol. Mass.:52175.81
Organism:Homo sapiens (Human)
Description:P35557
Residue:465
BDBM50248270
NameBDBM50248270
Synonyms:2-amino-5-chloro-N-(thiazol-2-yl)benzamide | CHEMBL446928
TypeSmall organic molecule
Emp. Form.C10H8ClN3OS
Mol. Mass.253.708
SMILESNc1ccc(Cl)cc1C(=O)Nc1nccs1