Reaction Details
TargetHexokinase-4
LigandBDBM50248271
Substrate/Competitorn/a
Meas. Tech.ChEMBL_565879 (CHEMBL959302)
EC50 1400±n/a nM
Citation Nishimura, TIino, TMitsuya, MBamba, MWatanabe, HTsukahara, DKamata, KSasaki, KOhyama, SHosaka, HFutamura, MNagata, YEiki, J Identification of novel and potent 2-amino benzamide derivatives as allosteric glucokinase activators. Bioorg Med Chem Lett19:1357-60 (2009) 
 
Hexokinase-4
Name:Hexokinase-4
Type:Enzyme
Mol. Mass.:52175.81
Organism:Homo sapiens (Human)
Description:P35557
Residue:465
BDBM50248271
NameBDBM50248271
Synonyms:2-amino-5-chloro-N-(4-methylthiazol-2-yl)benzamide | CHEMBL474748
TypeSmall organic molecule
Emp. Form.C11H10ClN3OS
Mol. Mass.267.735
SMILESCc1csc(NC(=O)c2cc(Cl)ccc2N)n1