Reaction Details
TargetHexokinase-4
LigandBDBM50248272
Substrate/Competitorn/a
Meas. Tech.ChEMBL_565878 (CHEMBL959301)
EC50>30000±n/a nM
Citation Nishimura, TIino, TMitsuya, MBamba, MWatanabe, HTsukahara, DKamata, KSasaki, KOhyama, SHosaka, HFutamura, MNagata, YEiki, J Identification of novel and potent 2-amino benzamide derivatives as allosteric glucokinase activators. Bioorg Med Chem Lett19:1357-60 (2009) 
 
Hexokinase-4
Name:Hexokinase-4
Type:Enzyme
Mol. Mass.:52175.81
Organism:Homo sapiens (Human)
Description:P35557
Residue:465
BDBM50248272
NameBDBM50248272
Synonyms:2-amino-N-(thiazol-2-yl)benzamide | CHEMBL474749
TypeSmall organic molecule
Emp. Form.C10H9N3OS
Mol. Mass.219.263
SMILESNc1ccccc1C(=O)Nc1nccs1