Reaction Details
TargetHexokinase-4
LigandBDBM50248273
Substrate/Competitorn/a
Meas. Tech.ChEMBL_565878 (CHEMBL959301)
EC50>30000±n/a nM
Citation Nishimura, TIino, TMitsuya, MBamba, MWatanabe, HTsukahara, DKamata, KSasaki, KOhyama, SHosaka, HFutamura, MNagata, YEiki, J Identification of novel and potent 2-amino benzamide derivatives as allosteric glucokinase activators. Bioorg Med Chem Lett19:1357-60 (2009) 
 
Hexokinase-4
Name:Hexokinase-4
Type:Enzyme
Mol. Mass.:52175.81
Organism:Homo sapiens (Human)
Description:P35557
Residue:465
BDBM50248273
NameBDBM50248273
Synonyms:2-amino-4-chloro-N-(4-methylthiazol-2-yl)benzamide | CHEMBL474750
TypeSmall organic molecule
Emp. Form.C11H10ClN3OS
Mol. Mass.267.735
SMILESCc1csc(NC(=O)c2ccc(Cl)cc2N)n1