Reaction Details
TargetHexokinase-4
LigandBDBM50186320
Substrate/Competitorn/a
Meas. Tech.ChEMBL_565878 (CHEMBL959301)
EC50 17000±n/a nM
Citation Nishimura, TIino, TMitsuya, MBamba, MWatanabe, HTsukahara, DKamata, KSasaki, KOhyama, SHosaka, HFutamura, MNagata, YEiki, J Identification of novel and potent 2-amino benzamide derivatives as allosteric glucokinase activators. Bioorg Med Chem Lett19:1357-60 (2009) 
 
Hexokinase-4
Name:Hexokinase-4
Type:Enzyme
Mol. Mass.:52175.81
Organism:Homo sapiens (Human)
Description:P35557
Residue:465
BDBM50186320
NameBDBM50186320
Synonyms:3-chloro-N-(4-methylthiazol-2-yl)benzamide | CHEMBL212529
TypeSmall organic molecule
Emp. Form.C11H9ClN2OS
Mol. Mass.252.72
SMILESCc1csc(NC(=O)c2cccc(Cl)c2)n1