Reaction Details
TargetHexokinase-4
LigandBDBM50248328
Substrate/Competitorn/a
Meas. Tech.ChEMBL_565879 (CHEMBL959302)
EC50 400±n/a nM
Citation Nishimura, TIino, TMitsuya, MBamba, MWatanabe, HTsukahara, DKamata, KSasaki, KOhyama, SHosaka, HFutamura, MNagata, YEiki, J Identification of novel and potent 2-amino benzamide derivatives as allosteric glucokinase activators. Bioorg Med Chem Lett19:1357-60 (2009) 
 
Hexokinase-4
Name:Hexokinase-4
Type:Enzyme
Mol. Mass.:52175.81
Organism:Homo sapiens (Human)
Description:P35557
Residue:465
BDBM50248328
NameBDBM50248328
Synonyms:2-amino-5-(4-fluorophenoxy)-N-(4-methylthiazol-2-yl)benzamide | CHEMBL474354
TypeSmall organic molecule
Emp. Form.C17H14FN3O2S
Mol. Mass.343.375
SMILESCc1csc(NC(=O)c2cc(Oc3ccc(F)cc3)ccc2N)n1