Reaction Details
TargetHexokinase-4
LigandBDBM50248329
Substrate/Competitorn/a
Meas. Tech.ChEMBL_565878 (CHEMBL959301)
EC50 410±n/a nM
Citation Nishimura, TIino, TMitsuya, MBamba, MWatanabe, HTsukahara, DKamata, KSasaki, KOhyama, SHosaka, HFutamura, MNagata, YEiki, J Identification of novel and potent 2-amino benzamide derivatives as allosteric glucokinase activators. Bioorg Med Chem Lett19:1357-60 (2009) 
 
Hexokinase-4
Name:Hexokinase-4
Type:Enzyme
Mol. Mass.:52175.81
Organism:Homo sapiens (Human)
Description:P35557
Residue:465
BDBM50248329
NameBDBM50248329
Synonyms:2-amino-5-(2-methoxyphenoxy)-N-(4-methylthiazol-2-yl)benzamide | CHEMBL474549
TypeSmall organic molecule
Emp. Form.C18H17N3O3S
Mol. Mass.355.411
SMILESCOc1ccccc1Oc1ccc(N)c(c1)C(=O)Nc1nc(C)cs1