Reaction Details
TargetHexokinase-4
LigandBDBM50248386
Substrate/Competitorn/a
Meas. Tech.ChEMBL_565879 (CHEMBL959302)
EC50 130±n/a nM
Citation Nishimura, TIino, TMitsuya, MBamba, MWatanabe, HTsukahara, DKamata, KSasaki, KOhyama, SHosaka, HFutamura, MNagata, YEiki, J Identification of novel and potent 2-amino benzamide derivatives as allosteric glucokinase activators. Bioorg Med Chem Lett19:1357-60 (2009) 
 
Hexokinase-4
Name:Hexokinase-4
Type:Enzyme
Mol. Mass.:52175.81
Organism:Homo sapiens (Human)
Description:P35557
Residue:465
BDBM50248386
NameBDBM50248386
Synonyms:2-amino-5-(2-(methylsulfonyl)phenoxy)-N-(4-methylthiazol-2-yl)benzamide | CHEMBL491329
TypeSmall organic molecule
Emp. Form.C18H17N3O4S2
Mol. Mass.403.475
SMILESCc1csc(NC(=O)c2cc(Oc3ccccc3S(C)(=O)=O)ccc2N)n1