Reaction Details
TargetHexokinase-4
LigandBDBM50248387
Substrate/Competitorn/a
Meas. Tech.ChEMBL_565879 (CHEMBL959302)
EC50 180±n/a nM
Citation Nishimura, TIino, TMitsuya, MBamba, MWatanabe, HTsukahara, DKamata, KSasaki, KOhyama, SHosaka, HFutamura, MNagata, YEiki, J Identification of novel and potent 2-amino benzamide derivatives as allosteric glucokinase activators. Bioorg Med Chem Lett19:1357-60 (2009) 
 
Hexokinase-4
Name:Hexokinase-4
Type:Enzyme
Mol. Mass.:52175.81
Organism:Homo sapiens (Human)
Description:P35557
Residue:465
BDBM50248387
NameBDBM50248387
Synonyms:2-amino-5-(ethylthio)-N-(4-methylthiazol-2-yl)benzamide | CHEMBL451084
TypeSmall organic molecule
Emp. Form.C13H15N3OS2
Mol. Mass.293.408
SMILESCCSc1ccc(N)c(c1)C(=O)Nc1nc(C)cs1