Reaction Details
TargetHexokinase-4
LigandBDBM50248388
Substrate/Competitorn/a
Meas. Tech.ChEMBL_565879 (CHEMBL959302)
EC50 200±n/a nM
Citation Nishimura, TIino, TMitsuya, MBamba, MWatanabe, HTsukahara, DKamata, KSasaki, KOhyama, SHosaka, HFutamura, MNagata, YEiki, J Identification of novel and potent 2-amino benzamide derivatives as allosteric glucokinase activators. Bioorg Med Chem Lett19:1357-60 (2009) 
 
Hexokinase-4
Name:Hexokinase-4
Type:Enzyme
Mol. Mass.:52175.81
Organism:Homo sapiens (Human)
Description:P35557
Residue:465
BDBM50248388
NameBDBM50248388
Synonyms:2-amino-N-(4-methylthiazol-2-yl)-5-(phenylthio)benzamide | CHEMBL489333
TypeSmall organic molecule
Emp. Form.C17H15N3OS2
Mol. Mass.341.451
SMILESCc1csc(NC(=O)c2cc(Sc3ccccc3)ccc2N)n1