Reaction Details
TargetHexokinase-4
LigandBDBM50248389
Substrate/Competitorn/a
Meas. Tech.ChEMBL_565878 (CHEMBL959301)
EC50 1200±n/a nM
Citation Nishimura, TIino, TMitsuya, MBamba, MWatanabe, HTsukahara, DKamata, KSasaki, KOhyama, SHosaka, HFutamura, MNagata, YEiki, J Identification of novel and potent 2-amino benzamide derivatives as allosteric glucokinase activators. Bioorg Med Chem Lett19:1357-60 (2009) 
 
Hexokinase-4
Name:Hexokinase-4
Type:Enzyme
Mol. Mass.:52175.81
Organism:Homo sapiens (Human)
Description:P35557
Residue:465
BDBM50248389
NameBDBM50248389
Synonyms:2-amino-N-(4-methylthiazol-2-yl)-5-(pyridin-2-ylthio)benzamide | CHEMBL523602
TypeSmall organic molecule
Emp. Form.C16H14N4OS2
Mol. Mass.342.439
SMILESCc1csc(NC(=O)c2cc(Sc3ccccn3)ccc2N)n1