Reaction Details
TargetHexokinase-4
LigandBDBM50248391
Substrate/Competitorn/a
Meas. Tech.ChEMBL_565878 (CHEMBL959301)
EC50 230±n/a nM
Citation Nishimura, TIino, TMitsuya, MBamba, MWatanabe, HTsukahara, DKamata, KSasaki, KOhyama, SHosaka, HFutamura, MNagata, YEiki, J Identification of novel and potent 2-amino benzamide derivatives as allosteric glucokinase activators. Bioorg Med Chem Lett19:1357-60 (2009) 
 
Hexokinase-4
Name:Hexokinase-4
Type:Enzyme
Mol. Mass.:52175.81
Organism:Homo sapiens (Human)
Description:P35557
Residue:465
BDBM50248391
NameBDBM50248391
Synonyms:2-amino-5-(1-methyl-1H-imidazol-2-ylthio)-N-(4-methylthiazol-2-yl)benzamide | CHEMBL489335
TypeSmall organic molecule
Emp. Form.C15H15N5OS2
Mol. Mass.345.443
SMILESCc1csc(NC(=O)c2cc(Sc3nccn3C)ccc2N)n1