Reaction Details
TargetHexokinase-4
LigandBDBM50248441
Substrate/Competitorn/a
Meas. Tech.ChEMBL_565878 (CHEMBL959301)
EC50 2400±n/a nM
Citation Nishimura, TIino, TMitsuya, MBamba, MWatanabe, HTsukahara, DKamata, KSasaki, KOhyama, SHosaka, HFutamura, MNagata, YEiki, J Identification of novel and potent 2-amino benzamide derivatives as allosteric glucokinase activators. Bioorg Med Chem Lett19:1357-60 (2009) 
 
Hexokinase-4
Name:Hexokinase-4
Type:Enzyme
Mol. Mass.:52175.81
Organism:Homo sapiens (Human)
Description:P35557
Residue:465
BDBM50248441
NameBDBM50248441
Synonyms:5-(4H-1,2,4-triazol-3-ylthio)-2-amino-N-(4-methylthiazol-2-yl)benzamide | CHEMBL446224
TypeSmall organic molecule
Emp. Form.C13H12N6OS2
Mol. Mass.332.404
SMILESCc1csc(NC(=O)c2cc(Sc3nnc[nH]3)ccc2N)n1