Reaction Details
TargetHexokinase-4
LigandBDBM50248444
Substrate/Competitorn/a
Meas. Tech.ChEMBL_565879 (CHEMBL959302)
EC50 180±n/a nM
Citation Nishimura, TIino, TMitsuya, MBamba, MWatanabe, HTsukahara, DKamata, KSasaki, KOhyama, SHosaka, HFutamura, MNagata, YEiki, J Identification of novel and potent 2-amino benzamide derivatives as allosteric glucokinase activators. Bioorg Med Chem Lett19:1357-60 (2009) 
 
Hexokinase-4
Name:Hexokinase-4
Type:Enzyme
Mol. Mass.:52175.81
Organism:Homo sapiens (Human)
Description:P35557
Residue:465
BDBM50248444
NameBDBM50248444
Synonyms:2-amino-N-(3-methyl-1,2,4-thiadiazol-5-yl)-5-(4-methyl-4H-1,2,4-triazol-3-ylthio)benzamide | CHEMBL489711
TypeSmall organic molecule
Emp. Form.C13H13N7OS2
Mol. Mass.347.419
SMILESCc1nsc(NC(=O)c2cc(Sc3nncn3C)ccc2N)n1