Reaction Details
TargetHexokinase-4
LigandBDBM50248487
Substrate/Competitorn/a
Meas. Tech.ChEMBL_565879 (CHEMBL959302)
EC50 130±n/a nM
Citation Nishimura, TIino, TMitsuya, MBamba, MWatanabe, HTsukahara, DKamata, KSasaki, KOhyama, SHosaka, HFutamura, MNagata, YEiki, J Identification of novel and potent 2-amino benzamide derivatives as allosteric glucokinase activators. Bioorg Med Chem Lett19:1357-60 (2009) 
 
Hexokinase-4
Name:Hexokinase-4
Type:Enzyme
Mol. Mass.:52175.81
Organism:Homo sapiens (Human)
Description:P35557
Residue:465
BDBM50248487
NameBDBM50248487
Synonyms:2-amino-5-(4-methyl-4H-1,2,4-triazol-3-ylthio)-N-(thiazol-2-yl)benzamide | CHEMBL491121
TypeSmall organic molecule
Emp. Form.C13H12N6OS2
Mol. Mass.332.404
SMILESCn1cnnc1Sc1ccc(N)c(c1)C(=O)Nc1nccs1