Reaction Details
TargetHexokinase-4
LigandBDBM50248489
Substrate/Competitorn/a
Meas. Tech.ChEMBL_565879 (CHEMBL959302)
EC50 420±n/a nM
Citation Nishimura, TIino, TMitsuya, MBamba, MWatanabe, HTsukahara, DKamata, KSasaki, KOhyama, SHosaka, HFutamura, MNagata, YEiki, J Identification of novel and potent 2-amino benzamide derivatives as allosteric glucokinase activators. Bioorg Med Chem Lett19:1357-60 (2009) 
 
Hexokinase-4
Name:Hexokinase-4
Type:Enzyme
Mol. Mass.:52175.81
Organism:Homo sapiens (Human)
Description:P35557
Residue:465
BDBM50248489
NameBDBM50248489
Synonyms:CHEMBL491322 | ethyl 2-(2-amino-5-(4-methyl-4H-1,2,4-triazol-3-ylthio)benzamido)thiazole-4-carboxylate
TypeSmall organic molecule
Emp. Form.C16H16N6O3S2
Mol. Mass.404.467
SMILESCCOC(=O)c1csc(NC(=O)c2cc(Sc3nncn3C)ccc2N)n1