Reaction Details
TargetHexokinase-4
LigandBDBM50248533
Substrate/Competitorn/a
Meas. Tech.ChEMBL_565878 (CHEMBL959301)
EC50 7300±n/a nM
Citation Nishimura, TIino, TMitsuya, MBamba, MWatanabe, HTsukahara, DKamata, KSasaki, KOhyama, SHosaka, HFutamura, MNagata, YEiki, J Identification of novel and potent 2-amino benzamide derivatives as allosteric glucokinase activators. Bioorg Med Chem Lett19:1357-60 (2009) 
 
Hexokinase-4
Name:Hexokinase-4
Type:Enzyme
Mol. Mass.:52175.81
Organism:Homo sapiens (Human)
Description:P35557
Residue:465
BDBM50248533
NameBDBM50248533
Synonyms:3-(4-methyl-4H-1,2,4-triazol-3-ylthio)-N-(4-methylthiazol-2-yl)benzamide N-(4-Methyl-1,3-thiazol-2-yl)-3-[(4-methyl-4H-1,2,4-triazol-3-yl)sulfanyl]benzamide
TypeSmall organic molecule
Emp. Form.C14H13N5OS2
Mol. Mass.331.416
SMILESCc1csc(NC(=O)c2cccc(Sc3nncn3C)c2)n1