Reaction Details
TargetHexokinase-4
LigandBDBM50248534
Substrate/Competitorn/a
Meas. Tech.ChEMBL_565879 (CHEMBL959302)
EC50>10000±n/a nM
Citation Nishimura, TIino, TMitsuya, MBamba, MWatanabe, HTsukahara, DKamata, KSasaki, KOhyama, SHosaka, HFutamura, MNagata, YEiki, J Identification of novel and potent 2-amino benzamide derivatives as allosteric glucokinase activators. Bioorg Med Chem Lett19:1357-60 (2009) 
 
Hexokinase-4
Name:Hexokinase-4
Type:Enzyme
Mol. Mass.:52175.81
Organism:Homo sapiens (Human)
Description:P35557
Residue:465
BDBM50248534
NameBDBM50248534
Synonyms:5-(4-methyl-4H-1,2,4-triazol-3-ylthio)-N-(4-methylthiazol-2-yl)-2-nitrobenzamide | CHEMBL491496
TypeSmall organic molecule
Emp. Form.C14H12N6O3S2
Mol. Mass.376.413
SMILESCc1csc(NC(=O)c2cc(Sc3nncn3C)ccc2[N+]([O-])=O)n1