Reaction Details
TargetHexokinase-4
LigandBDBM50248535
Substrate/Competitorn/a
Meas. Tech.ChEMBL_565879 (CHEMBL959302)
EC50 330±n/a nM
Citation Nishimura, TIino, TMitsuya, MBamba, MWatanabe, HTsukahara, DKamata, KSasaki, KOhyama, SHosaka, HFutamura, MNagata, YEiki, J Identification of novel and potent 2-amino benzamide derivatives as allosteric glucokinase activators. Bioorg Med Chem Lett19:1357-60 (2009) 
 
Hexokinase-4
Name:Hexokinase-4
Type:Enzyme
Mol. Mass.:52175.81
Organism:Homo sapiens (Human)
Description:P35557
Residue:465
BDBM50248535
NameBDBM50248535
Synonyms:2-(methylamino)-N-(4-methyl-1,3-thiazol-2-yl)-5-[(4-methyl-4H-1,2,4-triazol-3-yl)sulfanyl]benzamide CHEMBL490961
TypeSmall organic molecule
Emp. Form.C15H16N6OS2
Mol. Mass.360.457
SMILESCNc1ccc(Sc2nncn2C)cc1C(=O)Nc1nc(C)cs1