Reaction Details
TargetC-X-C chemokine receptor type 2
LigandBDBM50248589
Substrate/Competitorn/a
Meas. Tech.ChEMBL_566228 (CHEMBL963309)
Ki 4300±n/a nM
Citation Biju, PTaveras, AGYu, YZheng, JHipkin, RWFossetta, JFan, XFine, JLundell, D 3,4-Diamino-1,2,5-thiadiazole as potent and selective CXCR2 antagonists. Bioorg Med Chem Lett19:1434-7 (2009) 
 
C-X-C chemokine receptor type 2
Name:C-X-C chemokine receptor type 2
Type:Protein
Mol. Mass.:40767.88
Organism:Homo sapiens (Human)
Description:P25025
Residue:360
BDBM50248589
NameBDBM50248589
Synonyms:2-hydroxy-N,N-dimethyl-3-(4-(2,2,2-trifluoro-1-phenylethylamino)-1,2,5-thiadiazol-3-ylamino)benzamide | CHEMBL517430
TypeSmall organic molecule
Emp. Form.C19H18F3N5O2S
Mol. Mass.437.439
SMILESCN(C)C(=O)c1cccc(Nc2nsnc2NC(c2ccccc2)C(F)(F)F)c1O