Reaction Details
TargetCoagulation factor X
LigandBDBM50266920
Substrate/Competitorn/a
Meas. Tech.ChEMBL_563985 (CHEMBL956028)
IC50 0.05±n/a nM
Citation Van Huis, CACasimiro-Garcia, ABigge, CFCody, WLDudley, DAFilipski, KJHeemstra, RJKohrt, JTLeadley, RJNarasimhan, LSMcClanahan, TMochalkin, IPamment, MPeterson, JTSahasrabudhe, VSchaum, RPEdmunds, JJ Exploration of 4,4-disubstituted pyrrolidine-1,2-dicarboxamides as potent, orally active Factor Xa inhibitors with extended duration of action. Bioorg Med Chem17:2501-11 (2009) 
 
Coagulation factor X
Name:Coagulation factor X
Type:Enzyme
Mol. Mass.:54726.60
Organism:Homo sapiens (Human)
Description:n/a
Residue:488
BDBM50266920
NameBDBM50266920
Synonyms:(2R,4R)-N1-(4-Chlorophenyl)-4-ethoxy-4-ethyl-N2-(2-fluoro-4-(2-oxopyridin-1(2H)-yl)phenyl)pyrrolidine-1,2-dicarboxamide | CHEMBL476618
TypeSmall organic molecule
Emp. Form.C27H28ClFN4O4
Mol. Mass.526.987
SMILESCCO[C@]1(CC)C[C@@H](N(C1)C(=O)Nc1ccc(Cl)cc1)C(=O)Nc1ccc(cc1F)-n1ccccc1=O