Reaction Details
TargetCoagulation factor X
LigandBDBM50266890
Substrate/Competitorn/a
Meas. Tech.ChEMBL_563985 (CHEMBL956028)
IC50 0.54±n/a nM
Citation Van Huis, CACasimiro-Garcia, ABigge, CFCody, WLDudley, DAFilipski, KJHeemstra, RJKohrt, JTLeadley, RJNarasimhan, LSMcClanahan, TMochalkin, IPamment, MPeterson, JTSahasrabudhe, VSchaum, RPEdmunds, JJ Exploration of 4,4-disubstituted pyrrolidine-1,2-dicarboxamides as potent, orally active Factor Xa inhibitors with extended duration of action. Bioorg Med Chem17:2501-11 (2009) 
 
Coagulation factor X
Name:Coagulation factor X
Type:Enzyme
Mol. Mass.:54726.60
Organism:Homo sapiens (Human)
Description:n/a
Residue:488
BDBM50266890
NameBDBM50266890
Synonyms:(2R,4R)-N1-(4-Chlorophenyl)-N2-(2-fluoro-4-(3-methyl-2-oxopyridin-1(2H)-yl)phenyl)-4-hydroxy-4-methylpyrrolidine-1,2-dicarboxamide | CHEMBL477228
TypeSmall organic molecule
Emp. Form.C25H24ClFN4O4
Mol. Mass.498.934
SMILESCc1cccn(-c2ccc(NC(=O)[C@H]3C[C@@](C)(O)CN3C(=O)Nc3ccc(Cl)cc3)c(F)c2)c1=O