Reaction Details
TargetC-C chemokine receptor type 5
LigandBDBM50088301
Substrate/Competitorn/a
Meas. Tech.ChEMBL_566670 (CHEMBL960984)
IC50 1.4±n/a nM
Citation Kothandaraman, SDonnely, KLButora, GJiao, RPasternak, AMorriello, GJGoble, SDZhou, CMills, SGMaccoss, MVicario, PPAyala, JMDemartino, JAStruthers, MCascieri, MAYang, L Design, synthesis, and structure-activity relationship of novel CCR2 antagonists. Bioorg Med Chem Lett19:1830-4 (2009) 
 
C-C chemokine receptor type 5
Name:C-C chemokine receptor type 5
Type:Enzyme
Mol. Mass.:40540.21
Organism:Homo sapiens (Human)
Description:P51681
Residue:352
BDBM50088301
NameBDBM50088301
Synonyms:(E)-N,N-dimethyl-N-(4-(2-p-tolyl-6,7-dihydro-5H-benzo[7]annulene-8-carboxamido)benzyl)tetrahydro-2H-pyran-4-aminium chloride CHEMBL41275 Dimethyl-(tetrahydro-pyran-4-yl)-{4-[(3-p-tolyl-8,9-dihydro-7H-benzocycloheptene-6-carbonyl)-amino]-benzyl}-ammonium; chloride N-(4-(2-p-tolyl-6,7-dihydro-5H-benzo[7]annulene-8-carboxamido)benzyl)-N,N-dimethyl-tetrahydro-2H-pyran-4-aminium chloride | TAK-779
TypeSmall organic molecule
Emp. Form.C33H39N2O2
Mol. Mass.495.6744
SMILESCc1ccc(cc1)-c1ccc2CCCC(=Cc2c1)C(=O)Nc1ccc(C[N+](C)(C)C2CCOCC2)cc1