Reaction Details
TargetC-C chemokine receptor type 2
LigandBDBM50257994
Substrate/Competitorn/a
Meas. Tech.ChEMBL_566656 (CHEMBL960970)
IC50 0.100±n/a nM
Citation Kothandaraman, SDonnely, KLButora, GJiao, RPasternak, AMorriello, GJGoble, SDZhou, CMills, SGMaccoss, MVicario, PPAyala, JMDemartino, JAStruthers, MCascieri, MAYang, L Design, synthesis, and structure-activity relationship of novel CCR2 antagonists. Bioorg Med Chem Lett19:1830-4 (2009) 
 
C-C chemokine receptor type 2
Name:C-C chemokine receptor type 2
Type:Enzyme
Mol. Mass.:41932.32
Organism:Homo sapiens (Human)
Description:P41597
Residue:374
BDBM50257994
NameBDBM50257994
Synonyms:(1S,3R)-N-(3,5-bis(-trifluoromethyl)benzyl)-1-iso propyl-3-(3-methyltetrahydro-2H-pyran-4-ylamino)cyclopentanecarboxamide (1S,3R)-N-(3,5-bis(trifluoro methyl)benzyl)-1-isopropyl-3-(3-methyltetrahydro-2H-pyran-4-ylamino)cyclopentanecarboxamide CHEMBL494191
TypeSmall organic molecule
Emp. Form.C24H32F6N2O2
Mol. Mass.494.5135
SMILESCC(C)[C@@]1(CC[C@H](C1)NC1CCOCC1C)C(=O)NCc1cc(cc(c1)C(F)(F)F)C(F)(F)F