Reaction Details
TargetHuntingtin
LigandBDBM50257649
Substrate/Competitorn/a
Meas. Tech.ChEMBL_567037 (CHEMBL1029934)
IC50 1110±n/a nM
Citation Rinderspacher, ACremona, MLLiu, YDeng, SXXie, YGong, GAulner, NTöbben, UMyers, KChung, CAndersen, MVidovic, DSchürer, SBrandén, LYamamoto, ALandry, DW Potent inhibitors of Huntingtin protein aggregation in a cell-based assay. Bioorg Med Chem Lett19:1715-7 (2009) 
 
Huntingtin
Name:Huntingtin
Type:PROTEIN
Mol. Mass.:347579.69
Organism:Homo sapiens (Human)
Description:EBI_101216
Residue:3142
BDBM50257649
NameBDBM50257649
Synonyms:4-(2-(6-bromoquinazolin-4-ylamino)ethyl)phenol | CHEMBL500972
TypeSmall organic molecule
Emp. Form.C16H14BrN3O
Mol. Mass.344.206
SMILESOc1ccc(CCNc2ncnc3ccc(Br)cc23)cc1