Reaction Details
TargetGonadotropin-releasing hormone receptor
LigandBDBM50258246
Substrate/Competitorn/a
Meas. Tech.ChEMBL_566054 (CHEMBL954319)
IC50 19±n/a nM
Citation Hauze, DBChengalvala, MVCottom, JEFeingold, IBGarrick, LGreen, DMHuselton, CKao, WKees, KLundquist, JTMann, CWMehlmann, JFRogers, JFShanno, LWrobel, JPelletier, JC Small molecule antagonists of the gonadotropin-releasing hormone (GnRH) receptor: structure-activity relationships of small heterocyclic groups appended to the 2-phenyl-4-piperazinyl-benzimidazole template. Bioorg Med Chem Lett19:1986-90 (2009) 
 
Gonadotropin-releasing hormone receptor
Name:Gonadotropin-releasing hormone receptor
Type:Enzyme
Mol. Mass.:37749.45
Organism:Homo sapiens (Human)
Description:P30968
Residue:328
BDBM50258246
NameBDBM50258246
Synonyms:2-(4-tert-butylphenyl)-4-(4-((1-isopropyl-5-methyl-1H-imidazol-4-yl)methyl)piperazin-1-yl)-1H-benzo[d]imidazole | CHEMBL523849
TypeSmall organic molecule
Emp. Form.C29H38N6
Mol. Mass.470.6522
SMILESCC(C)n1cnc(CN2CCN(CC2)c2cccc3[nH]c(nc23)-c2ccc(cc2)C(C)(C)C)c1C