Reaction Details
TargetGonadotropin-releasing hormone receptor
LigandBDBM50257969
Substrate/Competitorn/a
Meas. Tech.ChEMBL_566054 (CHEMBL954319)
IC50 21±n/a nM
Citation Hauze, DBChengalvala, MVCottom, JEFeingold, IBGarrick, LGreen, DMHuselton, CKao, WKees, KLundquist, JTMann, CWMehlmann, JFRogers, JFShanno, LWrobel, JPelletier, JC Small molecule antagonists of the gonadotropin-releasing hormone (GnRH) receptor: structure-activity relationships of small heterocyclic groups appended to the 2-phenyl-4-piperazinyl-benzimidazole template. Bioorg Med Chem Lett19:1986-90 (2009) 
 
Gonadotropin-releasing hormone receptor
Name:Gonadotropin-releasing hormone receptor
Type:Enzyme
Mol. Mass.:37749.45
Organism:Homo sapiens (Human)
Description:P30968
Residue:328
BDBM50257969
NameBDBM50257969
Synonyms:4-(4-((1H-imidazol-4-yl)methyl)piperazin-1-yl)-2-(4-tert-butylphenyl)-1H-benzo[d]imidazole | CHEMBL494554
TypeSmall organic molecule
Emp. Form.C25H30N6
Mol. Mass.414.5459
SMILESCC(C)(C)c1ccc(cc1)-c1nc2c(cccc2[nH]1)N1CCN(Cc2cnc[nH]2)CC1