Reaction Details
TargetGonadotropin-releasing hormone receptor
LigandBDBM50258205
Substrate/Competitorn/a
Meas. Tech.ChEMBL_566078 (CHEMBL954343)
IC50 14±n/a nM
Citation Hauze, DBChengalvala, MVCottom, JEFeingold, IBGarrick, LGreen, DMHuselton, CKao, WKees, KLundquist, JTMann, CWMehlmann, JFRogers, JFShanno, LWrobel, JPelletier, JC Small molecule antagonists of the gonadotropin-releasing hormone (GnRH) receptor: structure-activity relationships of small heterocyclic groups appended to the 2-phenyl-4-piperazinyl-benzimidazole template. Bioorg Med Chem Lett19:1986-90 (2009) 
 
Gonadotropin-releasing hormone receptor
Name:Gonadotropin-releasing hormone receptor
Type:Enzyme
Mol. Mass.:37749.45
Organism:Homo sapiens (Human)
Description:P30968
Residue:328
BDBM50258205
NameBDBM50258205
Synonyms:2-(4-tert-butylphenyl)-4-(4-((1-ethyl-5-methyl-1H-imidazol-4-yl)methyl)piperazin-1-yl)-1H-benzo[d]imidazole | CHEMBL521674
TypeSmall organic molecule
Emp. Form.C28H36N6
Mol. Mass.456.6256
SMILESCCn1cnc(CN2CCN(CC2)c2cccc3[nH]c(nc23)-c2ccc(cc2)C(C)(C)C)c1C