Reaction Details
TargetHistone deacetylase 1
LigandBDBM50278420
Substrate/Competitorn/a
Meas. Tech.ChEMBL_564614 (CHEMBL964054)
IC50 9±n/a nM
Citation Heidebrecht, RWChenard, MClose, JDahlberg, WKFleming, JGrimm, JBHamill, JEHarsch, AHaines, BBHughes, BKral, AMMiddleton, REMushti, COzerova, NSzewczak, AAWang, HWilson, KWitter, DJSecrist, JPMiller, TA Exploring the pharmacokinetic properties of phosphorus-containing selective HDAC 1 and 2 inhibitors (SHI-1:2). Bioorg Med Chem Lett19:2053-8 (2009) 
 
Histone deacetylase 1
Name:Histone deacetylase 1
Type:Enzyme
Mol. Mass.:55090.27
Organism:Homo sapiens (Human)
Description:Q13547
Residue:482
BDBM50278420
NameBDBM50278420
Synonyms:CHEMBL513536 | N-(2-amino-5-(thiophen-2-yl)phenyl)-4-((diethylphosphoryl)methyl)benzamide
TypeSmall organic molecule
Emp. Form.C22H25N2O2PS
Mol. Mass.412.485
SMILESCCP(=O)(CC)Cc1ccc(cc1)C(=O)Nc1cc(ccc1N)-c1cccs1