Reaction Details
TargetPotassium voltage-gated channel subfamily H member 2
LigandBDBM50278105
Substrate/Competitorn/a
Meas. Tech.ChEMBL_501217 (CHEMBL975252)
IC50 59000±n/a nM
Citation Benbow, JWAndrews, KAAubrecht, JBeebe, DBoyer, DDoran, SHomiski, MHui, YMcPherson, KParker, JCTreadway, JVanvolkenberg, MZembrowski, WJ Piperidinyl-2-phenethylamino inhibitors of DPP-IV for the treatment of type 2 diabetes. Bioorg Med Chem Lett19:2220-3 (2009) 
 
Potassium voltage-gated channel subfamily H member 2
Name:Potassium voltage-gated channel subfamily H member 2
Type:Multi-pass membrane protein
Mol. Mass.:126672.65
Organism:Homo sapiens (Human)
Description:Q12809
Residue:1159
BDBM50278105
NameBDBM50278105
Synonyms:(R)-(4-(1-amino-2-(2,4,5-trifluorophenyl)ethyl)piperidin-1-yl)(imidazo[1,2-a]pyrimidin-3-yl)methanone | CHEMBL485125
TypeSmall organic molecule
Emp. Form.C20H20F3N5O
Mol. Mass.403.4009
SMILESN[C@H](Cc1cc(F)c(F)cc1F)C1CCN(CC1)C(=O)c1cnc2ncccn12