Reaction Details
TargetPotassium voltage-gated channel subfamily H member 2
LigandBDBM50278106
Substrate/Competitorn/a
Meas. Tech.ChEMBL_501217 (CHEMBL975252)
IC50 18000±n/a nM
Citation Benbow, JWAndrews, KAAubrecht, JBeebe, DBoyer, DDoran, SHomiski, MHui, YMcPherson, KParker, JCTreadway, JVanvolkenberg, MZembrowski, WJ Piperidinyl-2-phenethylamino inhibitors of DPP-IV for the treatment of type 2 diabetes. Bioorg Med Chem Lett19:2220-3 (2009) 
 
Potassium voltage-gated channel subfamily H member 2
Name:Potassium voltage-gated channel subfamily H member 2
Type:Multi-pass membrane protein
Mol. Mass.:126672.65
Organism:Homo sapiens (Human)
Description:Q12809
Residue:1159
BDBM50278106
NameBDBM50278106
Synonyms:(R)-(4-(1-amino-2-(2,4,5-trifluorophenyl)ethyl)piperidin-1-yl)(2,7-dimethylpyrazolo[1,5-a]pyrimidin-6-yl)methanone | CHEMBL484528
TypeSmall organic molecule
Emp. Form.C22H24F3N5O
Mol. Mass.431.4541
SMILESCc1cc2ncc(C(=O)N3CCC(CC3)[C@H](N)Cc3cc(F)c(F)cc3F)c(C)n2n1