Reaction Details
TargetDipeptidyl peptidase 4
LigandBDBM50278775
Substrate/Competitorn/a
Meas. Tech.ChEMBL_501197 (CHEMBL975310)
IC50>30000±n/a nM
Citation Benbow, JWAndrews, KAAubrecht, JBeebe, DBoyer, DDoran, SHomiski, MHui, YMcPherson, KParker, JCTreadway, JVanvolkenberg, MZembrowski, WJ Piperidinyl-2-phenethylamino inhibitors of DPP-IV for the treatment of type 2 diabetes. Bioorg Med Chem Lett19:2220-3 (2009) 
 
Dipeptidyl peptidase 4
Name:Dipeptidyl peptidase 4
Type:Enzyme
Mol. Mass.:88271.01
Organism:Homo sapiens (Human)
Description:P27487
Residue:766
BDBM50278775
NameBDBM50278775
Synonyms:(S)-2-(2,4,5-trifluorobenzyl)piperidine | CHEMBL469545
TypeSmall organic molecule
Emp. Form.C12H14F3N
Mol. Mass.229.2415
SMILESFc1cc(F)c(C[C@@H]2CCCCN2)cc1F