Reaction Details
TargetDipeptidyl peptidase 4
LigandBDBM50278838
Substrate/Competitorn/a
Meas. Tech.ChEMBL_501197 (CHEMBL975310)
IC50 1970±n/a nM
Citation Benbow, JWAndrews, KAAubrecht, JBeebe, DBoyer, DDoran, SHomiski, MHui, YMcPherson, KParker, JCTreadway, JVanvolkenberg, MZembrowski, WJ Piperidinyl-2-phenethylamino inhibitors of DPP-IV for the treatment of type 2 diabetes. Bioorg Med Chem Lett19:2220-3 (2009) 
 
Dipeptidyl peptidase 4
Name:Dipeptidyl peptidase 4
Type:Enzyme
Mol. Mass.:88271.01
Organism:Homo sapiens (Human)
Description:P27487
Residue:766
BDBM50278838
NameBDBM50278838
Synonyms:(R)-1-(pyridin-4-yl)-2-(2,4,5-trifluorophenyl)ethanamine | CHEMBL496691
TypeSmall organic molecule
Emp. Form.C13H11F3N2
Mol. Mass.252.235
SMILESN[C@H](Cc1cc(F)c(F)cc1F)c1ccncc1