Reaction Details
TargetDipeptidyl peptidase 4
LigandBDBM50278106
Substrate/Competitorn/a
Meas. Tech.ChEMBL_501197 (CHEMBL975310)
IC50 4±n/a nM
Citation Benbow, JWAndrews, KAAubrecht, JBeebe, DBoyer, DDoran, SHomiski, MHui, YMcPherson, KParker, JCTreadway, JVanvolkenberg, MZembrowski, WJ Piperidinyl-2-phenethylamino inhibitors of DPP-IV for the treatment of type 2 diabetes. Bioorg Med Chem Lett19:2220-3 (2009) 
 
Dipeptidyl peptidase 4
Name:Dipeptidyl peptidase 4
Type:Enzyme
Mol. Mass.:88271.01
Organism:Homo sapiens (Human)
Description:P27487
Residue:766
BDBM50278106
NameBDBM50278106
Synonyms:(R)-(4-(1-amino-2-(2,4,5-trifluorophenyl)ethyl)piperidin-1-yl)(2,7-dimethylpyrazolo[1,5-a]pyrimidin-6-yl)methanone | CHEMBL484528
TypeSmall organic molecule
Emp. Form.C22H24F3N5O
Mol. Mass.431.4541
SMILESCc1cc2ncc(C(=O)N3CCC(CC3)[C@H](N)Cc3cc(F)c(F)cc3F)c(C)n2n1