Reaction Details
TargetProstaglandin G/H synthase 1
LigandBDBM50293280
Substrate/Competitorn/a
Meas. Tech.ChEMBL_501261 (CHEMBL976163)
IC50 87.0±n/a nM
Citation Feng, ZChu, FGuo, ZSun, P Synthesis and anti-inflammatory activity of the major metabolites of imrecoxib. Bioorg Med Chem Lett19:2270-2 (2009) 
 
Prostaglandin G/H synthase 1
Name:Prostaglandin G/H synthase 1
Type:PROTEIN
Mol. Mass.:69044.61
Organism:Mus musculus
Description:ChEMBL_10575
Residue:602
BDBM50293280
NameBDBM50293280
Synonyms:3-(4-(hydroxymethyl)phenyl)-4-(4-(methylsulfonyl)phenyl)-1-propyl-1H-pyrrol-2(5H)-one | CHEMBL469785
TypeSmall organic molecule
Emp. Form.C21H23NO4S
Mol. Mass.385.477
SMILESCCCN1CC(=C(C1=O)c1ccc(CO)cc1)c1ccc(cc1)S(C)(=O)=O