Reaction Details
TargetEpidermal growth factor receptor
LigandBDBM50278651
Substrate/Competitorn/a
Meas. Tech.ChEMBL_501564 (CHEMBL987693)
IC50 4±n/a nM
Citation Lin, RJohnson, SGConnolly, PJWetter, SKBinnun, EHughes, TVMurray, WVPandey, NBMoreno-Mazza, SJAdams, MFuentes-Pesquera, ARMiddleton, SA Synthesis and evaluation of 2,7-diamino-thiazolo[4,5-d] pyrimidine analogues as anti-tumor epidermal growth factor receptor (EGFR) tyrosine kinase inhibitors. Bioorg Med Chem Lett19:2333-7 (2009) 
 
Epidermal growth factor receptor
Name:Epidermal growth factor receptor
Type:Receptor Kinase Domain
Mol. Mass.:134279.59
Organism:Homo sapiens (Human)
Description:P00533
Residue:1210
BDBM50278651
NameBDBM50278651
Synonyms:CHEMBL470219 | N7-(3-chloro-4-fluorophenyl)-N2-(4-(pyrrolidin-1-ylmethyl)phenyl)thiazolo[4,5-d]pyrimidine-2,7-diamine
TypeSmall organic molecule
Emp. Form.C22H20ClFN6S
Mol. Mass.454.951
SMILESFc1ccc(Nc2ncnc3nc(Nc4ccc(CN5CCCC5)cc4)sc23)cc1Cl