Reaction Details
Target5-hydroxytryptamine receptor 2B
LigandBDBM50249134
Substrate/Competitorn/a
Meas. Tech.ChEMBL_499778 (CHEMBL968751)
IC50 19±n/a nM
Citation Moss, NChoi, YCogan, DFlegg, AKahrs, ALoke, PMeyn, ONagaraja, RNapier, SParker, AThomas Peterson, JRamsden, PSarko, CSkow, DTomlinson, JTye, HWhitaker, M A new class of 5-HT2B antagonists possesses favorable potency, selectivity, and rat pharmacokinetic properties. Bioorg Med Chem Lett19:2206-10 (2009) 
 
5-hydroxytryptamine receptor 2B
Name:5-hydroxytryptamine receptor 2B
Type:G Protein-Coupled Receptor (GPCR)
Mol. Mass.:54312.47
Organism:Homo sapiens (Human)
Description:Receptor binding assays were performed using human clone stably expressed in CHO cells.
Residue:481
BDBM50249134
NameBDBM50249134
Synonyms:4-(4-fluoronaphthalen-1-yl)-6-isopropylpyrimidin-2-amine RS-127445
TypeSmall organic molecule
Emp. Form.C17H16FN3
Mol. Mass.281.3274
SMILESCC(C)c1cc(nc(N)n1)-c1ccc(F)c2ccccc12