Reaction Details
Target5-hydroxytryptamine receptor 2B
LigandBDBM50249132
Substrate/Competitorn/a
Meas. Tech.ChEMBL_499777 (CHEMBL968750)
IC50 0.2±n/a nM
Citation Moss, NChoi, YCogan, DFlegg, AKahrs, ALoke, PMeyn, ONagaraja, RNapier, SParker, AThomas Peterson, JRamsden, PSarko, CSkow, DTomlinson, JTye, HWhitaker, M A new class of 5-HT2B antagonists possesses favorable potency, selectivity, and rat pharmacokinetic properties. Bioorg Med Chem Lett19:2206-10 (2009) 
 
5-hydroxytryptamine receptor 2B
Name:5-hydroxytryptamine receptor 2B
Type:G Protein-Coupled Receptor (GPCR)
Mol. Mass.:54312.47
Organism:Homo sapiens (Human)
Description:Receptor binding assays were performed using human clone stably expressed in CHO cells.
Residue:481
BDBM50249132
NameBDBM50249132
Synonyms:(4-((1H-imidazol-2-yl)methyl)piperidin-1-yl)(4'-fluorobiphenyl-4-yl)methanone | CHEMBL473185
TypeSmall organic molecule
Emp. Form.C22H22FN3O
Mol. Mass.363.428
SMILESFc1ccc(cc1)-c1ccc(cc1)C(=O)N1CCC(Cc2ncc[nH]2)CC1