Reaction Details
Target5-hydroxytryptamine receptor 2B
LigandBDBM50249483
Substrate/Competitorn/a
Meas. Tech.ChEMBL_499777 (CHEMBL968750)
IC50 0.3±n/a nM
Citation Moss, NChoi, YCogan, DFlegg, AKahrs, ALoke, PMeyn, ONagaraja, RNapier, SParker, AThomas Peterson, JRamsden, PSarko, CSkow, DTomlinson, JTye, HWhitaker, M A new class of 5-HT2B antagonists possesses favorable potency, selectivity, and rat pharmacokinetic properties. Bioorg Med Chem Lett19:2206-10 (2009) 
 
5-hydroxytryptamine receptor 2B
Name:5-hydroxytryptamine receptor 2B
Type:G Protein-Coupled Receptor (GPCR)
Mol. Mass.:54312.47
Organism:Homo sapiens (Human)
Description:Receptor binding assays were performed using human clone stably expressed in CHO cells.
Residue:481
BDBM50249483
NameBDBM50249483
Synonyms:1-(biphenyl-4-ylsulfonyl)-4-(1H-imidazol-2-yl)piperidine | CHEMBL475407
TypeSmall organic molecule
Emp. Form.C20H21N3O2S
Mol. Mass.367.465
SMILESO=S(=O)(N1CCC(CC1)c1ncc[nH]1)c1ccc(cc1)-c1ccccc1