Reaction Details
Target5-hydroxytryptamine receptor 2B
LigandBDBM50249176
Substrate/Competitorn/a
Meas. Tech.ChEMBL_499777 (CHEMBL968750)
IC50 1.9±n/a nM
Citation Moss, NChoi, YCogan, DFlegg, AKahrs, ALoke, PMeyn, ONagaraja, RNapier, SParker, AThomas Peterson, JRamsden, PSarko, CSkow, DTomlinson, JTye, HWhitaker, M A new class of 5-HT2B antagonists possesses favorable potency, selectivity, and rat pharmacokinetic properties. Bioorg Med Chem Lett19:2206-10 (2009) 
 
5-hydroxytryptamine receptor 2B
Name:5-hydroxytryptamine receptor 2B
Type:G Protein-Coupled Receptor (GPCR)
Mol. Mass.:54312.47
Organism:Homo sapiens (Human)
Description:Receptor binding assays were performed using human clone stably expressed in CHO cells.
Residue:481
BDBM50249176
NameBDBM50249176
Synonyms:2-(1-(biphenyl-4-ylsulfonyl)piperidin-4-yl)-1H-benzo[d]imidazole | CHEMBL514934
TypeSmall organic molecule
Emp. Form.C24H23N3O2S
Mol. Mass.417.523
SMILESO=S(=O)(N1CCC(CC1)c1nc2ccccc2[nH]1)c1ccc(cc1)-c1ccccc1