Reaction Details
TargetCytochrome P450 2C9
LigandBDBM50277754
Substrate/Competitorn/a
Meas. Tech.ChEMBL_501339 (CHEMBL1009689)
IC50 47000±n/a nM
Citation Shen, HCDing, FXDeng, QWilsie, LCKrsmanovic, MLTaggart, AKCarballo-Jane, ERen, NCai, TQWu, TJWu, KKCheng, KChen, QWolff, MSTong, XHolt, TGWaters, MGHammond, MLTata, JRColletti, SL Discovery of novel tricyclic full agonists for the G-protein-coupled niacin receptor 109A with minimized flushing in rats. J Med Chem52:2587-602 (2009) 
 
Cytochrome P450 2C9
Name:Cytochrome P450 2C9
Type:Enzyme
Mol. Mass.:55636.33
Organism:Homo sapiens (Human)
Description:P11712
Residue:490
BDBM50277754
NameBDBM50277754
Synonyms:2-(3-(7-hydroxy-4,5-dihydronaphtho[2,1-d]isoxazol-3-yl)propanamido)cyclopent-1-enecarboxylic acid | CHEMBL485326
TypeSmall organic molecule
Emp. Form.C20H20N2O5
Mol. Mass.368.3832
SMILESOC(=O)C1=C(CCC1)NC(=O)CCc1noc-2c1CCc1cc(O)ccc-21