Reaction Details
TargetHydroxycarboxylic acid receptor 2
LigandBDBM50277675
Substrate/Competitorn/a
Meas. Tech.ChEMBL_501337 (CHEMBL971523)
IC50 2100±n/a nM
Citation Shen, HCDing, FXDeng, QWilsie, LCKrsmanovic, MLTaggart, AKCarballo-Jane, ERen, NCai, TQWu, TJWu, KKCheng, KChen, QWolff, MSTong, XHolt, TGWaters, MGHammond, MLTata, JRColletti, SL Discovery of novel tricyclic full agonists for the G-protein-coupled niacin receptor 109A with minimized flushing in rats. J Med Chem52:2587-602 (2009) 
 
Hydroxycarboxylic acid receptor 2
Name:Hydroxycarboxylic acid receptor 2
Type:G Protein-Coupled Receptor (GPCR)
Mol. Mass.:41868.22
Organism:Homo sapiens (Human)
Description:Membranes from CHO cells expressing the recombinant human GPR109A were used in competition binding assay.
Residue:363
BDBM50277675
NameBDBM50277675
Synonyms:2-(3-(6-hydroxy-1-methyl-1,4-dihydroindeno[1,2-c]pyrazol-3-yl)propanamido)benzoic acid | CHEMBL483996
TypeSmall organic molecule
Emp. Form.C21H19N3O4
Mol. Mass.377.3933
SMILESCn1nc(CCC(=O)Nc2ccccc2C(O)=O)c2Cc3cc(O)ccc3-c12