Reaction Details
TargetHydroxycarboxylic acid receptor 2
LigandBDBM50277581
Substrate/Competitorn/a
Meas. Tech.ChEMBL_501336 (CHEMBL971522)
EC50 51±n/a nM
Citation Shen, HCDing, FXDeng, QWilsie, LCKrsmanovic, MLTaggart, AKCarballo-Jane, ERen, NCai, TQWu, TJWu, KKCheng, KChen, QWolff, MSTong, XHolt, TGWaters, MGHammond, MLTata, JRColletti, SL Discovery of novel tricyclic full agonists for the G-protein-coupled niacin receptor 109A with minimized flushing in rats. J Med Chem52:2587-602 (2009) 
 
Hydroxycarboxylic acid receptor 2
Name:Hydroxycarboxylic acid receptor 2
Type:G Protein-Coupled Receptor (GPCR)
Mol. Mass.:41868.22
Organism:Homo sapiens (Human)
Description:Membranes from CHO cells expressing the recombinant human GPR109A were used in competition binding assay.
Residue:363
BDBM50277581
NameBDBM50277581
Synonyms:2-(3-(7-hydroxynaphtho[2,1-d]isoxazol-3-yl)propanamido)benzoic acid | CHEMBL520299
TypeSmall organic molecule
Emp. Form.C21H16N2O5
Mol. Mass.376.3621
SMILESOC(=O)c1ccccc1NC(=O)CCc1noc2c1ccc1cc(O)ccc21