Reaction Details
TargetHydroxycarboxylic acid receptor 2
LigandBDBM50277633
Substrate/Competitorn/a
Meas. Tech.ChEMBL_501336 (CHEMBL971522)
EC50 40±n/a nM
Citation Shen, HCDing, FXDeng, QWilsie, LCKrsmanovic, MLTaggart, AKCarballo-Jane, ERen, NCai, TQWu, TJWu, KKCheng, KChen, QWolff, MSTong, XHolt, TGWaters, MGHammond, MLTata, JRColletti, SL Discovery of novel tricyclic full agonists for the G-protein-coupled niacin receptor 109A with minimized flushing in rats. J Med Chem52:2587-602 (2009) 
 
Hydroxycarboxylic acid receptor 2
Name:Hydroxycarboxylic acid receptor 2
Type:G Protein-Coupled Receptor (GPCR)
Mol. Mass.:41868.22
Organism:Homo sapiens (Human)
Description:Membranes from CHO cells expressing the recombinant human GPR109A were used in competition binding assay.
Residue:363
BDBM50277633
NameBDBM50277633
Synonyms:2-(3-(7-hydroxy-[1,2,3]triazolo[1,5-a]quinolin-3-yl)propanamido)benzoic acid | CHEMBL521326
TypeSmall organic molecule
Emp. Form.C20H16N4O4
Mol. Mass.376.3654
SMILESOC(=O)c1ccccc1NC(=O)CCc1nnn2c1ccc1cc(O)ccc21