Reaction Details
TargetHydroxycarboxylic acid receptor 2
LigandBDBM50277753
Substrate/Competitorn/a
Meas. Tech.ChEMBL_501336 (CHEMBL971522)
EC50 76±n/a nM
Citation Shen, HCDing, FXDeng, QWilsie, LCKrsmanovic, MLTaggart, AKCarballo-Jane, ERen, NCai, TQWu, TJWu, KKCheng, KChen, QWolff, MSTong, XHolt, TGWaters, MGHammond, MLTata, JRColletti, SL Discovery of novel tricyclic full agonists for the G-protein-coupled niacin receptor 109A with minimized flushing in rats. J Med Chem52:2587-602 (2009) 
 
Hydroxycarboxylic acid receptor 2
Name:Hydroxycarboxylic acid receptor 2
Type:G Protein-Coupled Receptor (GPCR)
Mol. Mass.:41868.22
Organism:Homo sapiens (Human)
Description:Membranes from CHO cells expressing the recombinant human GPR109A were used in competition binding assay.
Residue:363
BDBM50277753
NameBDBM50277753
Synonyms:2-[3-(7-Hydroxy-benzo[d]imidazo[2,1-b]thiazol-2-yl)-propionylamino]-cyclohex-1-enecarboxylic acid | CHEMBL520513
TypeSmall organic molecule
Emp. Form.C19H19N3O4S
Mol. Mass.385.437
SMILESOC(=O)C1=C(CCCC1)NC(=O)CCc1cn2c(n1)sc1cc(O)ccc21